Target
Receptor-type tyrosine-protein phosphatase mu
Ligand
BDBM50112357
Substrate
Meas. Tech.
ChEMBL_1513408 (CHEMBL3611563)
IC50
>50000±n/a nM
Citation
 He, RYu, ZHZhang, RYWu, LGunawan, AMLane, BSShim, JSZeng, LFHe, YChen, LWells, CDLiu, JOZhang, ZY Exploring the Existing Drug Space for Novel pTyr Mimetic and SHP2 Inhibitors. ACS Med Chem Lett 6:782-6 (2015)  
Target
Name:
Receptor-type tyrosine-protein phosphatase mu
Synonyms:
PTPRL1 PTPRM_HUMAN Receptor-type tyrosine-protein phosphatase mu | Receptor-type tyrosine-protein phosphatase mu (PTPμ)
Type:
Protein
Mol. Mass.:
163683.56
Organism:
Homo sapiens (Human)
Description:
P28827
Residue:
1452
  
Inhibitor
Name:
BDBM50112357
Synonyms:
CHEMBL3609375
Type:
Small organic molecule
Emp. Form.:
C25H25N3O6S
Mol. Mass.:
495.548
SMILES:
CC(C)c1ccc(NC(=O)C(=O)Nc2ccc(NC(=O)C(c3ccccc3)S(O)(=O)=O)cc2)cc1
: