Target
Receptor-type tyrosine-protein phosphatase mu
Ligand
BDBM50112358
Substrate
Meas. Tech.
ChEMBL_1513408 (CHEMBL3611563)
IC50
>50000±n/a nM
Citation
 He, RYu, ZHZhang, RYWu, LGunawan, AMLane, BSShim, JSZeng, LFHe, YChen, LWells, CDLiu, JOZhang, ZY Exploring the Existing Drug Space for Novel pTyr Mimetic and SHP2 Inhibitors. ACS Med Chem Lett 6:782-6 (2015)  
Target
Name:
Receptor-type tyrosine-protein phosphatase mu
Synonyms:
PTPRL1 PTPRM_HUMAN Receptor-type tyrosine-protein phosphatase mu | Receptor-type tyrosine-protein phosphatase mu (PTPμ)
Type:
Protein
Mol. Mass.:
163683.56
Organism:
Homo sapiens (Human)
Description:
P28827
Residue:
1452
  
Inhibitor
Name:
BDBM50112358
Synonyms:
CHEMBL3609374
Type:
Small organic molecule
Emp. Form.:
C28H23N3O6S
Mol. Mass.:
529.564
SMILES:
OS(=O)(=O)C(C(=O)Nc1ccc(NC(=O)C(=O)Nc2ccc(cc2)-c2ccccc2)cc1)c1ccccc1
: