Target
Cytochrome P450 2C19
Ligand
BDBM50114572
Substrate
Meas. Tech.
ChEMBL_1513825 (CHEMBL3611143)
EC50
1040±n/a nM
Citation
 Bae, IHKim, HSYou, YChough, CChoe, WSeon, MKLee, SGKeum, GJang, SKMoon Kim, B Novel benzidine and diaminofluorene prolinamide derivatives as potent hepatitis C virus NS5A inhibitors. Eur J Med Chem 101:163-78 (2015)  
Target
Name:
Cytochrome P450 2C19
Synonyms:
(R)-limonene 6-monooxygenase (S)-limonene 7-monooxygenase CYP2C19 CYPIIC19 Cytochrome P450 2C19 [I331V] Cytochrome P450-254C Mephenytoin 4-hydroxylase P450-254C
Type:
Enzyme
Mol. Mass.:
55935.47
Organism:
Homo sapiens (Human)
Description:
P33261
Residue:
490
  
Inhibitor
Name:
BDBM50114572
Synonyms:
CHEMBL3608916
Type:
Small organic molecule
Emp. Form.:
C42H42Cl2N6O8
Mol. Mass.:
829.724
SMILES:
COC(=O)N[C@@H](C(=O)N1CCC[C@H]1C(=O)Nc1ccc(c(Cl)c1)-c1ccc(NC(=O)[C@@H]2CCCN2C(=O)[C@H](NC(=O)OC)c2ccccc2)cc1Cl)c1ccccc1
: