Target
Cytochrome P450 2C19
Ligand
BDBM50114573
Substrate
Meas. Tech.
ChEMBL_1513825 (CHEMBL3611143)
EC50
2940±n/a nM
Citation
 Bae, IHKim, HSYou, YChough, CChoe, WSeon, MKLee, SGKeum, GJang, SKMoon Kim, B Novel benzidine and diaminofluorene prolinamide derivatives as potent hepatitis C virus NS5A inhibitors. Eur J Med Chem 101:163-78 (2015)  
Target
Name:
Cytochrome P450 2C19
Synonyms:
(R)-limonene 6-monooxygenase (S)-limonene 7-monooxygenase CYP2C19 CYPIIC19 Cytochrome P450 2C19 [I331V] Cytochrome P450-254C Mephenytoin 4-hydroxylase P450-254C
Type:
Enzyme
Mol. Mass.:
55935.47
Organism:
Homo sapiens (Human)
Description:
P33261
Residue:
490
  
Inhibitor
Name:
BDBM50114573
Synonyms:
CHEMBL3608920
Type:
Small organic molecule
Emp. Form.:
C45H48N6O8
Mol. Mass.:
800.898
SMILES:
COC(=O)N[C@@H](C(=O)N1CCC[C@H]1C(=O)Nc1ccc2-c3ccc(NC(=O)[C@@H]4CCCN4C(=O)[C@H](NC(=O)OC)c4ccccc4)cc3C(C)(C)c2c1)c1ccccc1
: