Target
Cytochrome P450 3A4
Ligand
BDBM50114574
Substrate
Meas. Tech.
ChEMBL_1513826 (CHEMBL3611144)
EC50
976±n/a nM
Citation
 Bae, IHKim, HSYou, YChough, CChoe, WSeon, MKLee, SGKeum, GJang, SKMoon Kim, B Novel benzidine and diaminofluorene prolinamide derivatives as potent hepatitis C virus NS5A inhibitors. Eur J Med Chem 101:163-78 (2015)  
Target
Name:
Cytochrome P450 3A4
Synonyms:
Albendazole monooxygenase CP3A4_HUMAN CYP3A4 CYPIIIA4 Cytochrome P450 3A4 (CYP3A4) Nifedipine oxidase Taurochenodeoxycholate 6-alpha-hydroxylase
Type:
Enzyme
Mol. Mass.:
57349.57
Organism:
Homo sapiens (Human)
Description:
Residue:
503
  
Inhibitor
Name:
BDBM50114574
Synonyms:
CHEMBL3608921
Type:
Small organic molecule
Emp. Form.:
C43H42F2N6O8
Mol. Mass.:
808.8258
SMILES:
COC(=O)N[C@@H](C(=O)N1CCC[C@H]1C(=O)Nc1ccc2-c3ccc(NC(=O)[C@@H]4CCCN4C(=O)[C@H](NC(=O)OC)c4ccccc4)cc3C(F)(F)c2c1)c1ccccc1
: