Target
Polyunsaturated fatty acid 5-lipoxygenase
Ligand
BDBM50116904
Substrate
Meas. Tech.
ChEMBL_1515806 (CHEMBL3614568)
IC50
920±n/a nM
Citation
 De Lucia, DLucio, OMMusio, BBender, AListing, MDennhardt, SKoeberle, AGarscha, URizzo, RManfredini, SWerz, OLey, SV Design, synthesis and evaluation of semi-synthetic triazole-containing caffeic acid analogues as 5-lipoxygenase inhibitors. Eur J Med Chem 101:573-83 (2015)  
Target
Name:
Polyunsaturated fatty acid 5-lipoxygenase
Synonyms:
5-LO 5-Lipoxygenase (5-LO) 5-Lipoygenase ALOX5 LOG5 | LOX5_HUMAN
Type:
Enzyme
Mol. Mass.:
77972.74
Organism:
Homo sapiens (Human)
Description:
Recombinant protein was purified from E. coli lysate. After ammonium sulfate precipitation and subsequent steps, the supernatant (S100) was used for 5-LO activity assay.
Residue:
674
  
Inhibitor
Name:
BDBM50116904
Synonyms:
CHEMBL3613024
Type:
Small organic molecule
Emp. Form.:
C19H20O6
Mol. Mass.:
344.3585
SMILES:
CC(=O)Oc1ccc(\C=C\C(=O)OCCCCC#C)cc1OC(C)=O
: