Target
Polyunsaturated fatty acid 5-lipoxygenase
Ligand
BDBM50116890
Substrate
Meas. Tech.
ChEMBL_1515808 (CHEMBL3614570)
IC50
>10000±n/a nM
Citation
 De Lucia, DLucio, OMMusio, BBender, AListing, MDennhardt, SKoeberle, AGarscha, URizzo, RManfredini, SWerz, OLey, SV Design, synthesis and evaluation of semi-synthetic triazole-containing caffeic acid analogues as 5-lipoxygenase inhibitors. Eur J Med Chem 101:573-83 (2015)  
Target
Name:
Polyunsaturated fatty acid 5-lipoxygenase
Synonyms:
5-LO 5-Lipoxygenase (5-LO) 5-Lipoygenase ALOX5 LOG5 | LOX5_HUMAN
Type:
Enzyme
Mol. Mass.:
77972.74
Organism:
Homo sapiens (Human)
Description:
Recombinant protein was purified from E. coli lysate. After ammonium sulfate precipitation and subsequent steps, the supernatant (S100) was used for 5-LO activity assay.
Residue:
674
  
Inhibitor
Name:
BDBM50116890
Synonyms:
CHEMBL3613038
Type:
Small organic molecule
Emp. Form.:
C36H41N3O11
Mol. Mass.:
691.7242
SMILES:
CC(=O)Oc1ccc(\C=C\C(=O)OCCc2cnnn2CCCOC(=O)C2(C)CCc3c(C)c(OC(C)=O)c(C)c(C)c3O2)cc1OC(C)=O
: