Target
Carbonic anhydrase 2
Ligand
BDBM50118206
Substrate
Meas. Tech.
ChEMBL_1514780 (CHEMBL3615102)
Ki
75±n/a nM
Citation
 Rankin, GMVullo, DSupuran, CTPoulsen, SA Phosphate Chemical Probes Designed for Location Specific Inhibition of Intracellular Carbonic Anhydrases. J Med Chem 58:7580-90 (2015)  
Target
Name:
Carbonic anhydrase 2
Synonyms:
CA-II CAC Carbonate dehydratase II Carbonic anhydrase 2 (CA-II) Carbonic anhydrase C Carbonic anhydrase II (CA-II) Carbonic anhydrase II (hCA II) | Carbonic anhydrase isoenzyme II (hCA II)
Type:
Enzyme
Mol. Mass.:
29250.71
Organism:
Homo sapiens (Human)
Description:
P00918
Residue:
260
  
Inhibitor
Name:
BDBM50118206
Synonyms:
CHEMBL3613285
Type:
Small organic molecule
Emp. Form.:
C26H44NO15PS3
Mol. Mass.:
737.794
SMILES:
CC(=O)O[C@@H]1[C@@H](COP(=O)(OCCSC(=O)C(C)(C)C)OCCSC(=O)C(C)(C)C)O[C@H]([C@H](OC(C)=O)[C@H]1OC(C)=O)S(N)(=O)=O
: