Target
Carbonic anhydrase 1
Ligand
BDBM50118192
Substrate
Meas. Tech.
ChEMBL_1514779 (CHEMBL3615101)
Ki
564±n/a nM
Citation
 Rankin, GMVullo, DSupuran, CTPoulsen, SA Phosphate Chemical Probes Designed for Location Specific Inhibition of Intracellular Carbonic Anhydrases. J Med Chem 58:7580-90 (2015)  
Target
Name:
Carbonic anhydrase 1
Synonyms:
CA-I CAB Carbonate dehydratase I Carbonic anhydrase 1 (CA I) Carbonic anhydrase 1 (Recombinant CA I) Carbonic anhydrase B Carbonic anhydrase I (CA I) Carbonic anhydrase I (CAI) Carbonic anhydrase isoenzyme I (hCA I) | hCA
Type:
Enzyme
Mol. Mass.:
28873.37
Organism:
Homo sapiens (Human)
Description:
P00915
Residue:
261
  
Inhibitor
Name:
BDBM50118192
Synonyms:
CHEMBL3613286
Type:
Small organic molecule
Emp. Form.:
C14H19N4O10PS
Mol. Mass.:
466.36
SMILES:
NS(=O)(=O)c1ccc(cc1)-c1cn(nn1)[C@@H]1O[C@H](COP(O)(O)=O)[C@@H](O)[C@H](O)[C@H]1O
: