Target
Carbonic anhydrase 1
Ligand
BDBM50118206
Substrate
Meas. Tech.
ChEMBL_1514779 (CHEMBL3615101)
Ki
860±n/a nM
Citation
 Rankin, GMVullo, DSupuran, CTPoulsen, SA Phosphate Chemical Probes Designed for Location Specific Inhibition of Intracellular Carbonic Anhydrases. J Med Chem 58:7580-90 (2015)  
Target
Name:
Carbonic anhydrase 1
Synonyms:
CA-I CAB Carbonate dehydratase I Carbonic anhydrase 1 (CA I) Carbonic anhydrase 1 (Recombinant CA I) Carbonic anhydrase B Carbonic anhydrase I (CA I) Carbonic anhydrase I (CAI) Carbonic anhydrase isoenzyme I (hCA I) | hCA
Type:
Enzyme
Mol. Mass.:
28873.37
Organism:
Homo sapiens (Human)
Description:
P00915
Residue:
261
  
Inhibitor
Name:
BDBM50118206
Synonyms:
CHEMBL3613285
Type:
Small organic molecule
Emp. Form.:
C26H44NO15PS3
Mol. Mass.:
737.794
SMILES:
CC(=O)O[C@@H]1[C@@H](COP(=O)(OCCSC(=O)C(C)(C)C)OCCSC(=O)C(C)(C)C)O[C@H]([C@H](OC(C)=O)[C@H]1OC(C)=O)S(N)(=O)=O
: