Target
Carbonic anhydrase 1
Ligand
BDBM50118208
Substrate
Meas. Tech.
ChEMBL_1514779 (CHEMBL3615101)
Ki
437±n/a nM
Citation
 Rankin, GMVullo, DSupuran, CTPoulsen, SA Phosphate Chemical Probes Designed for Location Specific Inhibition of Intracellular Carbonic Anhydrases. J Med Chem 58:7580-90 (2015)  
Target
Name:
Carbonic anhydrase 1
Synonyms:
CA-I CAB Carbonate dehydratase I Carbonic anhydrase 1 (CA I) Carbonic anhydrase 1 (Recombinant CA I) Carbonic anhydrase B Carbonic anhydrase I (CA I) Carbonic anhydrase I (CAI) Carbonic anhydrase isoenzyme I (hCA I) | hCA
Type:
Enzyme
Mol. Mass.:
28873.37
Organism:
Homo sapiens (Human)
Description:
P00915
Residue:
261
  
Inhibitor
Name:
BDBM50118208
Synonyms:
CHEMBL3613283
Type:
Small organic molecule
Emp. Form.:
C27H29N4O13PS
Mol. Mass.:
680.577
SMILES:
CC(=O)O[C@@H]1[C@@H](COP2(=O)OCc3ccccc3O2)O[C@H]([C@H](OC(C)=O)[C@H]1OC(C)=O)n1cc(nn1)-c1ccc(cc1)S(N)(=O)=O
: