Target
Carbonic anhydrase 2
Ligand
BDBM50118209
Substrate
Meas. Tech.
ChEMBL_1514780 (CHEMBL3615102)
Ki
52±n/a nM
Citation
 Rankin, GMVullo, DSupuran, CTPoulsen, SA Phosphate Chemical Probes Designed for Location Specific Inhibition of Intracellular Carbonic Anhydrases. J Med Chem 58:7580-90 (2015)  
Target
Name:
Carbonic anhydrase 2
Synonyms:
CA-II CAC Carbonate dehydratase II Carbonic anhydrase 2 (CA-II) Carbonic anhydrase C Carbonic anhydrase II (CA-II) Carbonic anhydrase II (hCA II) | Carbonic anhydrase isoenzyme II (hCA II)
Type:
Enzyme
Mol. Mass.:
29250.71
Organism:
Homo sapiens (Human)
Description:
P00918
Residue:
260
  
Inhibitor
Name:
BDBM50118209
Synonyms:
CHEMBL3613287
Type:
Small organic molecule
Emp. Form.:
C6H14NO10PS
Mol. Mass.:
323.215
SMILES:
NS(=O)(=O)[C@@H]1O[C@H](COP(O)(O)=O)[C@@H](O)[C@H](O)[C@H]1O
: