Target
Carbonic anhydrase 9
Ligand
BDBM50118206
Substrate
Meas. Tech.
ChEMBL_1514781 (CHEMBL3615103)
Ki
154±n/a nM
Citation
 Rankin, GMVullo, DSupuran, CTPoulsen, SA Phosphate Chemical Probes Designed for Location Specific Inhibition of Intracellular Carbonic Anhydrases. J Med Chem 58:7580-90 (2015)  
Target
Name:
Carbonic anhydrase 9
Synonyms:
CA-IX CAH9_HUMAN Carbonic anhydrase 9 (CA IX) Carbonic anhydrase 9 precursor Carbonic anhydrase IX (CAIX) Carbonic anhydrases; II & IX MN RCC-associated antigen G250
Type:
Enzyme
Mol. Mass.:
49669.03
Organism:
Homo sapiens (Human)
Description:
Catalytic domain of human cloned isozyme was used in the assay
Residue:
459
  
Inhibitor
Name:
BDBM50118206
Synonyms:
CHEMBL3613285
Type:
Small organic molecule
Emp. Form.:
C26H44NO15PS3
Mol. Mass.:
737.794
SMILES:
CC(=O)O[C@@H]1[C@@H](COP(=O)(OCCSC(=O)C(C)(C)C)OCCSC(=O)C(C)(C)C)O[C@H]([C@H](OC(C)=O)[C@H]1OC(C)=O)S(N)(=O)=O
: