Target
Carbonic anhydrase 9
Ligand
BDBM50118192
Substrate
Meas. Tech.
ChEMBL_1514781 (CHEMBL3615103)
Ki
248±n/a nM
Citation
 Rankin, GMVullo, DSupuran, CTPoulsen, SA Phosphate Chemical Probes Designed for Location Specific Inhibition of Intracellular Carbonic Anhydrases. J Med Chem 58:7580-90 (2015)  
Target
Name:
Carbonic anhydrase 9
Synonyms:
CA-IX CAH9_HUMAN Carbonic anhydrase 9 (CA IX) Carbonic anhydrase 9 precursor Carbonic anhydrase IX (CAIX) Carbonic anhydrases; II & IX MN RCC-associated antigen G250
Type:
Enzyme
Mol. Mass.:
49669.03
Organism:
Homo sapiens (Human)
Description:
Catalytic domain of human cloned isozyme was used in the assay
Residue:
459
  
Inhibitor
Name:
BDBM50118192
Synonyms:
CHEMBL3613286
Type:
Small organic molecule
Emp. Form.:
C14H19N4O10PS
Mol. Mass.:
466.36
SMILES:
NS(=O)(=O)c1ccc(cc1)-c1cn(nn1)[C@@H]1O[C@H](COP(O)(O)=O)[C@@H](O)[C@H](O)[C@H]1O
: