Target
Carbonic anhydrase 12
Ligand
BDBM50118208
Substrate
Meas. Tech.
ChEMBL_1514782 (CHEMBL3615104)
Ki
51±n/a nM
Citation
 Rankin, GMVullo, DSupuran, CTPoulsen, SA Phosphate Chemical Probes Designed for Location Specific Inhibition of Intracellular Carbonic Anhydrases. J Med Chem 58:7580-90 (2015)  
Target
Name:
Carbonic anhydrase 12
Synonyms:
CA-XII CAH12_HUMAN Carbonic anhydrase Carbonic anhydrase XII Carbonic anhydrase XII (CAXII) | Tumor antigen HOM-RCC-3.1.3
Type:
Enzyme
Mol. Mass.:
39456.00
Organism:
Homo sapiens (Human)
Description:
Catalytic domain of human cloned isozyme was used in the assay
Residue:
354
  
Inhibitor
Name:
BDBM50118208
Synonyms:
CHEMBL3613283
Type:
Small organic molecule
Emp. Form.:
C27H29N4O13PS
Mol. Mass.:
680.577
SMILES:
CC(=O)O[C@@H]1[C@@H](COP2(=O)OCc3ccccc3O2)O[C@H]([C@H](OC(C)=O)[C@H]1OC(C)=O)n1cc(nn1)-c1ccc(cc1)S(N)(=O)=O
: