Target
Carbonic anhydrase 12
Ligand
BDBM50118209
Substrate
Meas. Tech.
ChEMBL_1514782 (CHEMBL3615104)
Ki
90±n/a nM
Citation
 Rankin, GMVullo, DSupuran, CTPoulsen, SA Phosphate Chemical Probes Designed for Location Specific Inhibition of Intracellular Carbonic Anhydrases. J Med Chem 58:7580-90 (2015)  
Target
Name:
Carbonic anhydrase 12
Synonyms:
CA-XII CAH12_HUMAN Carbonic anhydrase Carbonic anhydrase XII Carbonic anhydrase XII (CAXII) | Tumor antigen HOM-RCC-3.1.3
Type:
Enzyme
Mol. Mass.:
39456.00
Organism:
Homo sapiens (Human)
Description:
Catalytic domain of human cloned isozyme was used in the assay
Residue:
354
  
Inhibitor
Name:
BDBM50118209
Synonyms:
CHEMBL3613287
Type:
Small organic molecule
Emp. Form.:
C6H14NO10PS
Mol. Mass.:
323.215
SMILES:
NS(=O)(=O)[C@@H]1O[C@H](COP(O)(O)=O)[C@@H](O)[C@H](O)[C@H]1O
: