Target
Serine/threonine-protein kinase TNNI3K
Ligand
BDBM50118383
Substrate
Meas. Tech.
ChEMBL_1515051 (CHEMBL3616263)
IC50
7.9±n/a nM
Citation
 Lawhorn, BGPhilp, JZhao, YLouer, CHammond, MCheung, MFries, HGraves, APShewchuk, LWang, LCottom, JEQi, HZhao, HTotoritis, RZhang, GSchwartz, BLi, HSweitzer, SHolt, DAGatto, GJKallander, LS Identification of Purines and 7-Deazapurines as Potent and Selective Type I Inhibitors of Troponin I-Interacting Kinase (TNNI3K). J Med Chem 58:7431-48 (2015)  
Target
Name:
Serine/threonine-protein kinase TNNI3K
Synonyms:
CARK TNI3K_HUMAN | TNNI3K
Type:
Enzyme Catalytic Domain
Mol. Mass.:
92855.14
Organism:
Homo sapiens (Human)
Description:
gi_7705748
Residue:
835
  
Inhibitor
Name:
BDBM50118383
Synonyms:
CHEMBL3613199
Type:
Small organic molecule
Emp. Form.:
C18H22N6O3S
Mol. Mass.:
402.471
SMILES:
CNS(=O)(=O)c1ccc(N2CCOCC2)c(Nc2ncnc3[nH]cc(C)c23)c1
: