Target
Sodium channel protein type 3 subunit alpha
Ligand
BDBM50118516
Substrate
Meas. Tech.
ChEMBL_1516897 (CHEMBL3618950)
IC50
<20±n/a nM
Citation
 de Lera Ruiz, MKraus, RL Voltage-Gated Sodium Channels: Structure, Function, Pharmacology, and Clinical Indications. J Med Chem 58:7093-118 (2015)  
Target
Name:
Sodium channel protein type 3 subunit alpha
Synonyms:
KIAA1356 NAC3 SCN3A_HUMAN Sodium channel alpha subunits; brain (Types I, II, III) Voltage-gated sodium channel subunit alpha Nav1.3 (Nav1.3)
Type:
Protein
Mol. Mass.:
226276.42
Organism:
Homo sapiens (Human)
Description:
Q9NY46
Residue:
2000
  
Inhibitor
Name:
BDBM50118516
Synonyms:
CHEMBL3617053
Type:
Small organic molecule
Emp. Form.:
C23H19N3O3S2
Mol. Mass.:
449.545
SMILES:
O=C(Nc1ccc(cc1)S(=O)(=O)Nc1nccs1)C(c1ccccc1)c1ccccc1
: