Target
Glucagon receptor
Ligand
BDBM123557
Substrate
Meas. Tech.
ChEMBL_1518548 (CHEMBL3619087)
Ki
17±n/a nM
Citation
 Sammons, MFLee, EC Recent progress in the development of small-molecule glucagon receptor antagonists. Bioorg Med Chem Lett 25:4057-64 (2015)  
Target
Name:
Glucagon receptor
Synonyms:
GCGR GLR_HUMAN Glucagon receptor (GlucR)
Type:
Enzyme
Mol. Mass.:
54026.92
Organism:
Homo sapiens (Human)
Description:
P47871
Residue:
477
  
Inhibitor
Name:
BDBM123557
Synonyms:
US8748624, 43
Type:
Small organic molecule
Emp. Form.:
C31H24ClF6N3O3
Mol. Mass.:
635.984
SMILES:
Cc1cc(ccc1-c1ccc(NCc2ccc(cc2-c2ccc(nc2)C(=O)NCCC(O)=O)C(F)(F)F)cc1Cl)C(F)(F)F
: