Target
Deoxyribonuclease-1
Ligand
BDBM50121702
Substrate
Meas. Tech.
ChEMBL_1516649 (CHEMBL3620429)
IC50
>100000±n/a nM
Citation
 Chapman, TMGillen, KJWallace, CLee, MTBakrania, PKhurana, PCoombs, PJStennett, LFox, SBureau, EABrownlees, JMelton, DWSaxty, B Catechols and 3-hydroxypyridones as inhibitors of the DNA repair complex ERCC1-XPF. Bioorg Med Chem Lett 25:4097-103 (2015)  
Target
Name:
Deoxyribonuclease-1
Synonyms:
DNAS1_HUMAN DNL1 DNase I Deoxyribonuclease I INN=Dornase alfa
Type:
PROTEIN
Mol. Mass.:
31422.78
Organism:
Homo sapiens (Human)
Description:
ChEMBL_109543
Residue:
282
  
Inhibitor
Name:
BDBM50121702
Synonyms:
CHEMBL3616995
Type:
Small organic molecule
Emp. Form.:
C16H17NO3
Mol. Mass.:
271.3111
SMILES:
Oc1ccc(CNC(=O)CCc2ccccc2)cc1O
: