Target
Nuclear receptor ROR-beta
Ligand
BDBM50121939
Substrate
Meas. Tech.
ChEMBL_1517043 (CHEMBL3619502)
EC50
7900±n/a nM
Citation
 Fauber, BPGobbi, ASavy, PBurton, BDeng, YEverett, CLa, HJohnson, ARLockey, PNorman, MWong, H Identification of N-sulfonyl-tetrahydroquinolines as RORc inverse agonists. Bioorg Med Chem Lett 25:4109-13 (2015)  
Target
Name:
Nuclear receptor ROR-beta
Synonyms:
NR1F2 Nuclear receptor subfamily 1 group F member 2 RORB_HUMAN Retinoid-related orphan receptor-beta
Type:
PROTEIN
Mol. Mass.:
53227.30
Organism:
Homo sapiens (Human)
Description:
ChEMBL_107979
Residue:
470
  
Inhibitor
Name:
BDBM50121939
Synonyms:
CHEMBL3617297
Type:
Small organic molecule
Emp. Form.:
C21H15F3N2O3S
Mol. Mass.:
432.416
SMILES:
Fc1ccc(cc1)S(=O)(=O)N1CCc2ccc(NC(=O)c3c(F)cccc3F)cc12
: