Target
Bile acid receptor
Ligand
BDBM50121939
Substrate
Meas. Tech.
ChEMBL_1517047 (CHEMBL3619625)
EC50
4200±n/a nM
Citation
 Fauber, BPGobbi, ASavy, PBurton, BDeng, YEverett, CLa, HJohnson, ARLockey, PNorman, MWong, H Identification of N-sulfonyl-tetrahydroquinolines as RORc inverse agonists. Bioorg Med Chem Lett 25:4109-13 (2015)  
Target
Name:
Bile acid receptor
Synonyms:
BAR FXR HRR1 NR1H4_HUMAN RIP14 Retinoid X receptor-interacting protein 14 | farnesoid x receptor
Type:
Nuclear Receptor
Mol. Mass.:
55916.24
Organism:
Homo sapiens (Human)
Description:
Q96RI1
Residue:
486
  
Inhibitor
Name:
BDBM50121939
Synonyms:
CHEMBL3617297
Type:
Small organic molecule
Emp. Form.:
C21H15F3N2O3S
Mol. Mass.:
432.416
SMILES:
Fc1ccc(cc1)S(=O)(=O)N1CCc2ccc(NC(=O)c3c(F)cccc3F)cc12
: