Target
Oxysterols receptor LXR-beta
Ligand
BDBM50044160
Substrate
Meas. Tech.
ChEMBL_1517046 (CHEMBL3619624)
EC50
2600±n/a nM
Citation
 Fauber, BPGobbi, ASavy, PBurton, BDeng, YEverett, CLa, HJohnson, ARLockey, PNorman, MWong, H Identification of N-sulfonyl-tetrahydroquinolines as RORc inverse agonists. Bioorg Med Chem Lett 25:4109-13 (2015)  
Target
Name:
Oxysterols receptor LXR-beta
Synonyms:
LXRB Liver X, LXR beta NR1H2 Nuclear receptor NER Ubiquitously-expressed nuclear receptor
Type:
Enzyme Catalytic Domain
Mol. Mass.:
50978.79
Organism:
Homo sapiens (Human)
Description:
P55055
Residue:
460
  
Inhibitor
Name:
BDBM50044160
Synonyms:
CHEMBL3314003
Type:
Small organic molecule
Emp. Form.:
C22H17ClF2N2O3S
Mol. Mass.:
462.897
SMILES:
Fc1ccc(cc1)S(=O)(=O)N1CCCc2ccc(NC(=O)c3c(F)cccc3Cl)cc12
: