Target
D-aspartate oxidase
Ligand
BDBM50121995
Substrate
Meas. Tech.
ChEMBL_1517184 (CHEMBL3620074)
Ki
32600±n/a nM
Citation
 Katane, MYamada, SKawaguchi, GChinen, MMatsumura, MAndo, TDoi, INakayama, KKaneko, YMatsuda, SSaitoh, YMiyamoto, TSekine, MYamaotsu, NHirono, SHomma, H Identification of Novel D-Aspartate Oxidase Inhibitors by in Silico Screening and Their Functional and Structural Characterization in Vitro. J Med Chem 58:7328-40 (2015)  
Target
Name:
D-aspartate oxidase
Synonyms:
D-aspartate oxidase Ddo | OXDD_MOUSE
Type:
PROTEIN
Mol. Mass.:
37556.43
Organism:
Mus musculus
Description:
ChEMBL_109877
Residue:
341
  
Inhibitor
Name:
BDBM50121995
Synonyms:
CHEMBL3617316
Type:
Small organic molecule
Emp. Form.:
C6H4N4O3
Mol. Mass.:
180.121
SMILES:
OC(=O)c1cn2cnnc2nc1O
: