Target
Glucose-dependent insulinotropic receptor
Ligand
BDBM50122909
Substrate
Meas. Tech.
ChEMBL_1520114 (CHEMBL3625578)
EC50
15±n/a nM
Citation
 Liu, PHu, ZDuBois, BGMoyes, CRHunter, DNZhu, CKar, NFZhu, YGarfunkle, JKang, LChicchi, GEhrhardt, AWoods, ASeo, TWoods, Mvan Heek, MDingley, KHPang, JSalituro, GMPowell, JTerebetski, JLHornak, VCampeau, LCLamberson, JUjjainwalla, FMiller, MStamford, AWood, HBKowalski, TNargund, RPEdmondson, SD Design of Potent and Orally Active GPR119 Agonists for the Treatment of Type II Diabetes. ACS Med Chem Lett 6:936-41 (2015)  
Target
Name:
Glucose-dependent insulinotropic receptor
Synonyms:
GP119_MOUSE | Gpr119
Type:
PROTEIN
Mol. Mass.:
37009.07
Organism:
Mus musculus
Description:
ChEMBL_1506420
Residue:
335
  
Inhibitor
Name:
BDBM50122909
Synonyms:
CHEMBL3622169
Type:
Small organic molecule
Emp. Form.:
C22H28FN5O3
Mol. Mass.:
429.4878
SMILES:
CC1(CC1)OC(=O)N1CCC(CC1)[C@H]1C[C@H]1COCc1ccc(cc1F)-n1cnnn1
: