Target
Glucose-dependent insulinotropic receptor
Ligand
BDBM50122935
Substrate
Meas. Tech.
ChEMBL_1520114 (CHEMBL3625578)
EC50
3.6±n/a nM
Citation
 Liu, PHu, ZDuBois, BGMoyes, CRHunter, DNZhu, CKar, NFZhu, YGarfunkle, JKang, LChicchi, GEhrhardt, AWoods, ASeo, TWoods, Mvan Heek, MDingley, KHPang, JSalituro, GMPowell, JTerebetski, JLHornak, VCampeau, LCLamberson, JUjjainwalla, FMiller, MStamford, AWood, HBKowalski, TNargund, RPEdmondson, SD Design of Potent and Orally Active GPR119 Agonists for the Treatment of Type II Diabetes. ACS Med Chem Lett 6:936-41 (2015)  
Target
Name:
Glucose-dependent insulinotropic receptor
Synonyms:
GP119_MOUSE | Gpr119
Type:
PROTEIN
Mol. Mass.:
37009.07
Organism:
Mus musculus
Description:
ChEMBL_1506420
Residue:
335
  
Inhibitor
Name:
BDBM50122935
Synonyms:
CHEMBL3622164
Type:
Small organic molecule
Emp. Form.:
C20H25ClN4O3S
Mol. Mass.:
436.956
SMILES:
CS(=O)(=O)c1ccc(COC[C@@H]2C[C@@H]2C2CCN(CC2)c2ncc(Cl)cn2)nc1
: