Target
Cytochrome P450 2C8
Ligand
BDBM50123453
Substrate
Meas. Tech.
ChEMBL_1521058 (CHEMBL3624489)
IC50
>50±n/a nM
Citation
 Zeng, QWang, JCheng, ZChen, KJohnström, PVarnäs, KLi, DYYang, ZFZhang, X Discovery and Evaluation of Clinical Candidate AZD3759, a Potent, Oral Active, Central Nervous System-Penetrant, Epidermal Growth Factor Receptor Tyrosine Kinase Inhibitor. J Med Chem 58:8200-15 (2015)  
Target
Name:
Cytochrome P450 2C8
Synonyms:
CP2C8_HUMAN CYPIIC8 P450 IIC2 P450 form 1 | S-mephenytoin 4-hydroxylase
Type:
Protein
Mol. Mass.:
55839.23
Organism:
Homo sapiens (Human)
Description:
P10632
Residue:
490
  
Inhibitor
Name:
BDBM50123453
Synonyms:
CHEMBL3623290
Type:
Small organic molecule
Emp. Form.:
C22H23ClFN5O3
Mol. Mass.:
459.901
SMILES:
COc1cc2ncnc(Nc3cccc(Cl)c3F)c2cc1OC(=O)N1CCN(C)C[C@H]1C
: