Target
Acetylcholinesterase
Ligand
BDBM50124881
Substrate
Meas. Tech.
ChEMBL_1521646 (CHEMBL3626446)
IC50
6.5±n/a nM
Citation
 Camerino, EWong, DMTong, FKörber, FGross, ADIslam, RViayna, EMutunga, JMLi, JTotrov, MMBloomquist, JRCarlier, PR Difluoromethyl ketones: Potent inhibitors of wild type and carbamate-insensitive G119S mutant Anopheles gambiae acetylcholinesterase. Bioorg Med Chem Lett 25:4405-11 (2015)  
Target
Name:
Acetylcholinesterase
Synonyms:
ACES_HUMAN Acetylcholinesterase (AChE) | Acetylcholinesterase (human AChE)
Type:
Enzyme
Mol. Mass.:
67792.70
Organism:
Homo sapiens (Human)
Description:
P22303
Residue:
614
  
Inhibitor
Name:
BDBM50124881
Synonyms:
CHEMBL3623549
Type:
Small organic molecule
Emp. Form.:
C9H11F3N2O
Mol. Mass.:
220.1916
SMILES:
CCC(C)n1cc(cn1)C(=O)C(F)(F)F
: