Target
Acetylcholinesterase
Ligand
BDBM50124876
Substrate
Meas. Tech.
ChEMBL_1521647 (CHEMBL3626447)
IC50
8.7±n/a nM
Citation
 Camerino, EWong, DMTong, FKörber, FGross, ADIslam, RViayna, EMutunga, JMLi, JTotrov, MMBloomquist, JRCarlier, PR Difluoromethyl ketones: Potent inhibitors of wild type and carbamate-insensitive G119S mutant Anopheles gambiae acetylcholinesterase. Bioorg Med Chem Lett 25:4405-11 (2015)  
Target
Name:
Acetylcholinesterase
Synonyms:
ACES_HUMAN Acetylcholinesterase (AChE) | Acetylcholinesterase (human AChE)
Type:
Enzyme
Mol. Mass.:
67792.70
Organism:
Homo sapiens (Human)
Description:
P22303
Residue:
614
  
Inhibitor
Name:
BDBM50124876
Synonyms:
CHEMBL3623554
Type:
Small organic molecule
Emp. Form.:
C12H14F2O
Mol. Mass.:
212.2358
SMILES:
CC(C)(C)c1cccc(c1)C(=O)C(F)F
: