Target
Acetylcholinesterase
Ligand
BDBM50286926
Substrate
Meas. Tech.
ChEMBL_1521648 (CHEMBL3626448)
IC50
60±n/a nM
Citation
 Camerino, EWong, DMTong, FKörber, FGross, ADIslam, RViayna, EMutunga, JMLi, JTotrov, MMBloomquist, JRCarlier, PR Difluoromethyl ketones: Potent inhibitors of wild type and carbamate-insensitive G119S mutant Anopheles gambiae acetylcholinesterase. Bioorg Med Chem Lett 25:4405-11 (2015)  
Target
Name:
Acetylcholinesterase
Synonyms:
ACE1 ACES_ANOGA AChE Acetylcholinesterase
Type:
PROTEIN
Mol. Mass.:
80902.47
Organism:
Anopheles gambiae
Description:
ChEMBL_104567
Residue:
737
  
Inhibitor
Name:
BDBM50286926
Synonyms:
2,2-Dichloroethenyl dimethyl phosphate DDVP Dimethyl-2,2-dichlorovinyl phosphate Phosphoric acid, 2,2-dichlorovinyl dimethyl ester
Type:
Small organic molecule
Emp. Form.:
C4H7Cl2O4P
Mol. Mass.:
220.976
SMILES:
[#6]-[#8]P(=O)([#8]-[#6])[#8]\[#6]=[#6](/Cl)Cl
: