Target
Acetylcholinesterase
Ligand
BDBM50281126
Substrate
Meas. Tech.
ChEMBL_1521650 (CHEMBL3626450)
IC50
53±n/a nM
Citation
 Camerino, EWong, DMTong, FKörber, FGross, ADIslam, RViayna, EMutunga, JMLi, JTotrov, MMBloomquist, JRCarlier, PR Difluoromethyl ketones: Potent inhibitors of wild type and carbamate-insensitive G119S mutant Anopheles gambiae acetylcholinesterase. Bioorg Med Chem Lett 25:4405-11 (2015)  
Target
Name:
Acetylcholinesterase
Synonyms:
ACE1 ACES_ANOGA AChE Acetylcholinesterase
Type:
PROTEIN
Mol. Mass.:
80902.47
Organism:
Anopheles gambiae
Description:
ChEMBL_104567
Residue:
737
  
Inhibitor
Name:
BDBM50281126
Synonyms:
1-(3-tert-Butyl-phenyl)-2,2,2-trifluoro-ethanone | CHEMBL89354
Type:
Small organic molecule
Emp. Form.:
C12H13F3O
Mol. Mass.:
230.2262
SMILES:
CC(C)(C)c1cccc(c1)C(=O)C(F)(F)F
: