Target
Cytochrome P450 1A2
Ligand
BDBM50127985
Substrate
Meas. Tech.
ChEMBL_1523014 (CHEMBL3631346)
IC50
25200±n/a nM
Citation
 Garcia-Barrantes, PMCho, HPNiswender, CMByers, FWLocuson, CWBlobaum, ALXiang, ZRook, JMConn, PJLindsley, CW Development of Novel, CNS Penetrant Positive Allosteric Modulators for the Metabotropic Glutamate Receptor Subtype 1 (mGlu1), Based on an N-(3-Chloro-4-(1,3-dioxoisoindolin-2-yl)phenyl)-3-methylfuran-2-carboxamide Scaffold, That Potentiate Wild Type and Mutant mGlu1 Receptors Found in Schizophrenics J Med Chem 58:7959-71 (2015)  
Target
Name:
Cytochrome P450 1A2
Synonyms:
CP1A2_HUMAN CYPIA2 Cytochrome P(3)450 Cytochrome P450 1A2 (CYP1A2) Cytochrome P450-P3
Type:
Enzyme
Mol. Mass.:
58423.38
Organism:
Homo sapiens (Human)
Description:
P05177
Residue:
516
  
Inhibitor
Name:
BDBM50127985
Synonyms:
CHEMBL3628113
Type:
Small organic molecule
Emp. Form.:
C20H12ClFN2O4
Mol. Mass.:
398.772
SMILES:
Cc1ccoc1C(=O)Nc1ccc(N2C(=O)c3cccc(F)c3C2=O)c(Cl)c1
: