Target
Cytochrome P450 2C9
Ligand
BDBM50128021
Substrate
Meas. Tech.
ChEMBL_1523015 (CHEMBL3631347)
IC50
>30000±n/a nM
Citation
 Garcia-Barrantes, PMCho, HPNiswender, CMByers, FWLocuson, CWBlobaum, ALXiang, ZRook, JMConn, PJLindsley, CW Development of Novel, CNS Penetrant Positive Allosteric Modulators for the Metabotropic Glutamate Receptor Subtype 1 (mGlu1), Based on an N-(3-Chloro-4-(1,3-dioxoisoindolin-2-yl)phenyl)-3-methylfuran-2-carboxamide Scaffold, That Potentiate Wild Type and Mutant mGlu1 Receptors Found in Schizophrenics J Med Chem 58:7959-71 (2015)  
Target
Name:
Cytochrome P450 2C9
Synonyms:
(R)-limonene 6-monooxygenase CP2C9_HUMAN CYP2C9 Cytochrome P450 2C9 (CYP2C9 ) P-450MP P450 PB-1 | S-mephenytoin 4-hydroxylase
Type:
Enzyme
Mol. Mass.:
55636.33
Organism:
Homo sapiens (Human)
Description:
P11712
Residue:
490
  
Inhibitor
Name:
BDBM50128021
Synonyms:
CHEMBL3628116
Type:
Small organic molecule
Emp. Form.:
C20H10Cl3N3O3
Mol. Mass.:
446.671
SMILES:
Clc1cccc2C(=O)N(C(=O)c12)c1ccc(NC(=O)c2ncccc2Cl)cc1Cl
: