Target
Metabotropic glutamate receptor 1
Ligand
BDBM50128023
Substrate
Meas. Tech.
ChEMBL_1523145 (CHEMBL3631963)
IC50
140±n/a nM
Citation
 Garcia-Barrantes, PMCho, HPNiswender, CMByers, FWLocuson, CWBlobaum, ALXiang, ZRook, JMConn, PJLindsley, CW Development of Novel, CNS Penetrant Positive Allosteric Modulators for the Metabotropic Glutamate Receptor Subtype 1 (mGlu1), Based on an N-(3-Chloro-4-(1,3-dioxoisoindolin-2-yl)phenyl)-3-methylfuran-2-carboxamide Scaffold, That Potentiate Wild Type and Mutant mGlu1 Receptors Found in Schizophrenics J Med Chem 58:7959-71 (2015)  
Target
Name:
Metabotropic glutamate receptor 1
Synonyms:
GPRC1A GRM1_HUMAN Metabotropic Glutamate 1a | metabotropic glutamate 1
Type:
Enzyme
Mol. Mass.:
132358.19
Organism:
Homo sapiens (Human)
Description:
Q13255
Residue:
1194
  
Inhibitor
Name:
BDBM50128023
Synonyms:
CHEMBL3628281
Type:
Small organic molecule
Emp. Form.:
C19H16ClN3O3
Mol. Mass.:
369.802
SMILES:
CC1(C)C2C1C(=O)N(C2=O)c1ccc(NC(=O)c2ccccn2)cc1Cl
: