Target
Metabotropic glutamate receptor 1
Ligand
BDBM50128125
Substrate
Meas. Tech.
ChEMBL_1522993 (CHEMBL3631169)
EC50
97±n/a nM
Citation
 Garcia-Barrantes, PMCho, HPNiswender, CMByers, FWLocuson, CWBlobaum, ALXiang, ZRook, JMConn, PJLindsley, CW Development of Novel, CNS Penetrant Positive Allosteric Modulators for the Metabotropic Glutamate Receptor Subtype 1 (mGlu1), Based on an N-(3-Chloro-4-(1,3-dioxoisoindolin-2-yl)phenyl)-3-methylfuran-2-carboxamide Scaffold, That Potentiate Wild Type and Mutant mGlu1 Receptors Found in Schizophrenics J Med Chem 58:7959-71 (2015)  
Target
Name:
Metabotropic glutamate receptor 1
Synonyms:
GPRC1A GRM1_HUMAN Metabotropic Glutamate 1a | metabotropic glutamate 1
Type:
Enzyme
Mol. Mass.:
132358.19
Organism:
Homo sapiens (Human)
Description:
Q13255
Residue:
1194
  
Inhibitor
Name:
BDBM50128125
Synonyms:
CHEMBL3628104
Type:
Small organic molecule
Emp. Form.:
C20H13ClN2O4
Mol. Mass.:
380.781
SMILES:
Cc1ccoc1C(=O)Nc1ccc(N2C(=O)c3ccccc3C2=O)c(Cl)c1
: