Target
cAMP and cAMP-inhibited cGMP 3',5'-cyclic phosphodiesterase 10A
Ligand
BDBM50129267
Substrate
Meas. Tech.
ChEMBL_1523367 (CHEMBL3630287)
IC50
0.940000±n/a nM
Citation
 Yoshikawa, MKamisaki, HKunitomo, JOki, HKokubo, HSuzuki, AIkemoto, TNakashima, KKamiguchi, NHarada, AKimura, HTaniguchi, T Design and synthesis of a novel 2-oxindole scaffold as a highly potent and brain-penetrant phosphodiesterase 10A inhibitor. Bioorg Med Chem 23:7138-49 (2015)  
Target
Name:
cAMP and cAMP-inhibited cGMP 3',5'-cyclic phosphodiesterase 10A
Synonyms:
3',5'-cyclic phosphodiesterase PDE10A Phosphodiesterase 10 (PDE10) | Phosphodiesterase 10A
Type:
Protein
Mol. Mass.:
88412.52
Organism:
Homo sapiens (Human)
Description:
Q9Y233
Residue:
1055
  
Inhibitor
Name:
BDBM50129267
Synonyms:
CHEMBL3629540
Type:
Small organic molecule
Emp. Form.:
C23H18FN5O4
Mol. Mass.:
447.4185
SMILES:
COc1cn(nc(-c2ccnn2-c2ccccc2)c1=O)-c1ccc(cc1F)N1CCOC1=O
: