Target
Epidermal growth factor receptor
Ligand
BDBM4626
Substrate
Meas. Tech.
ChEMBL_1524114 (CHEMBL3631055)
IC50
400±n/a nM
Citation
 Ravez, SArsenlis, SBarczyk, ADupont, AFrédérick, RHesse, SKirsch, GDepreux, PGoossens, L Synthesis and biological evaluation of di-aryl urea derivatives as c-Kit inhibitors. Bioorg Med Chem 23:7340-7 (2015)  
Target
Name:
Epidermal growth factor receptor
Synonyms:
EGF Receptor Substrate EGFR_HUMAN ERBB1 Epidermal Growth Factor Receptor erbB-1 Epidermal growth factor receptor (EGFR) HER1 Proto-oncogene c-ErbB-1 Tyrosine-Protein Kinase ErbB-1
Type:
Receptor Kinase Domain
Mol. Mass.:
134279.59
Organism:
Homo sapiens (Human)
Description:
P00533
Residue:
1210
  
Inhibitor
Name:
BDBM4626
Synonyms:
Anilinoquinazoline deriv. 9 N-(3-chloro-4-fluorophenyl)-6,7-dimethoxyquinazolin-4-amine
Type:
Small organic molecule
Emp. Form.:
C16H13ClFN3O2
Mol. Mass.:
333.745
SMILES:
COc1cc2ncnc(Nc3ccc(F)c(Cl)c3)c2cc1OC
: