Target
Vascular endothelial growth factor receptor 1
Ligand
BDBM50380485
Substrate
Meas. Tech.
ChEMBL_1524119 (CHEMBL3631060)
IC50
46±n/a nM
Citation
 Ravez, SArsenlis, SBarczyk, ADupont, AFrédérick, RHesse, SKirsch, GDepreux, PGoossens, L Synthesis and biological evaluation of di-aryl urea derivatives as c-Kit inhibitors. Bioorg Med Chem 23:7340-7 (2015)  
Target
Name:
Vascular endothelial growth factor receptor 1
Synonyms:
FLT FRT Fms-like tyrosine kinase 1 Tyrosine-protein kinase FRT VEGFR-1 VGFR1_HUMAN Vascular endothelial growth factor receptor 1 (FLT1) Vascular endothelial growth factor receptor 1 and 2 (Flt-1 and KDR) Vascular permeability factor receptor vascular endothelial growth factor/vascular permeability factor receptor
Type:
Receptor Tyrosine Kinase
Mol. Mass.:
150800.23
Organism:
Homo sapiens (Human)
Description:
P17948
Residue:
1338
  
Inhibitor
Name:
BDBM50380485
Synonyms:
CHEMBL2018882
Type:
Small organic molecule
Emp. Form.:
C23H19BrN4O4
Mol. Mass.:
495.325
SMILES:
COc1cc2ncnc(Oc3ccc(NC(=O)Nc4cccc(Br)c4)cc3)c2cc1OC
: