Target
Mast/stem cell growth factor receptor Kit
Ligand
BDBM50129831
Substrate
Meas. Tech.
ChEMBL_1524122 (CHEMBL3631063)
IC50
6.0±n/a nM
Citation
 Ravez, SArsenlis, SBarczyk, ADupont, AFrédérick, RHesse, SKirsch, GDepreux, PGoossens, L Synthesis and biological evaluation of di-aryl urea derivatives as c-Kit inhibitors. Bioorg Med Chem 23:7340-7 (2015)  
Target
Name:
Mast/stem cell growth factor receptor Kit
Synonyms:
CD117 antigen KIT Mast/stem cell growth factor receptor Kit (cKIT) Proto-oncogene tyrosine-protein kinase Kit Stem cell growth factor receptor Tyrosine-protein kinase Kit c-kit v-kit Hardy-Zuckerman 4 feline sarcoma viral oncogene homolog
Type:
Protein
Mol. Mass.:
109869.37
Organism:
Homo sapiens (Human)
Description:
P10721
Residue:
976
  
Inhibitor
Name:
BDBM50129831
Synonyms:
CHEMBL3628799
Type:
Small organic molecule
Emp. Form.:
C23H20BrN5OS
Mol. Mass.:
494.407
SMILES:
Brc1cccc(NC(=O)Nc2ccc(Nc3ncnc4sc5CCCCc5c34)cc2)c1
: