Target
Vascular endothelial growth factor receptor 2
Ligand
BDBM50129841
Substrate
Meas. Tech.
ChEMBL_1524115 (CHEMBL3631056)
IC50
15±n/a nM
Citation
 Ravez, SArsenlis, SBarczyk, ADupont, AFrédérick, RHesse, SKirsch, GDepreux, PGoossens, L Synthesis and biological evaluation of di-aryl urea derivatives as c-Kit inhibitors. Bioorg Med Chem 23:7340-7 (2015)  
Target
Name:
Vascular endothelial growth factor receptor 2
Synonyms:
CD_antigen=CD309 Fetal liver kinase 1 (FLK-1) KDR Protein-tyrosine kinase receptor Flk-1 VEGFR-2 VEGFR2 Vascular Endothelial Growth Factor Receptor Kinase 2 Vascular endothelial growth factor receptor 2 (KDR) Vascular endothelial growth factor receptor 2 (VEGFR2) Vascular endothelial growth factor receptor-2 (VEGFR-2)
Type:
Receptor Tyrosine Kinase
Mol. Mass.:
151510.97
Organism:
Homo sapiens (Human)
Description:
P35968
Residue:
1356
  
Inhibitor
Name:
BDBM50129841
Synonyms:
CHEMBL3628907
Type:
Small organic molecule
Emp. Form.:
C23H18BrClN4O2S
Mol. Mass.:
529.837
SMILES:
Clc1cc(Oc2ncnc3sc4CCCCc4c23)ccc1NC(=O)Nc1cccc(Br)c1
: