Target
Vascular endothelial growth factor receptor 2
Ligand
BDBM50129838
Substrate
Meas. Tech.
ChEMBL_1524115 (CHEMBL3631056)
IC50
8.0±n/a nM
Citation
 Ravez, SArsenlis, SBarczyk, ADupont, AFrédérick, RHesse, SKirsch, GDepreux, PGoossens, L Synthesis and biological evaluation of di-aryl urea derivatives as c-Kit inhibitors. Bioorg Med Chem 23:7340-7 (2015)  
Target
Name:
Vascular endothelial growth factor receptor 2
Synonyms:
CD_antigen=CD309 Fetal liver kinase 1 (FLK-1) KDR Protein-tyrosine kinase receptor Flk-1 VEGFR-2 VEGFR2 Vascular Endothelial Growth Factor Receptor Kinase 2 Vascular endothelial growth factor receptor 2 (KDR) Vascular endothelial growth factor receptor 2 (VEGFR2) Vascular endothelial growth factor receptor-2 (VEGFR-2)
Type:
Receptor Tyrosine Kinase
Mol. Mass.:
151510.97
Organism:
Homo sapiens (Human)
Description:
P35968
Residue:
1356
  
Inhibitor
Name:
BDBM50129838
Synonyms:
CHEMBL3628807
Type:
Small organic molecule
Emp. Form.:
C21H15BrN4O2
Mol. Mass.:
435.273
SMILES:
Brc1cccc(NC(=O)Nc2ccc(Oc3ncnc4ccccc34)cc2)c1
: