Target
Serine/threonine-protein kinase pim-1
Ligand
BDBM50129863
Substrate
Meas. Tech.
ChEMBL_1524129 (CHEMBL3631070)
IC50
1100±n/a nM
Citation
 Giraud, FBourhis, MEbrahimi, EHerfindal, LChoudhury, RRBjørnstad, RDøskeland, SOAnizon, FMoreau, P Synthesis and activities of new indolopyrrolobenzodiazepine derivatives toward acute myeloid leukemia cells. Bioorg Med Chem 23:7313-23 (2015)  
Target
Name:
Serine/threonine-protein kinase pim-1
Synonyms:
PIM-1 Kinase PIM1_HUMAN Serine/threonine-protein kinase (PIM1) Serine/threonine-protein kinase PIM1 | Serine/threonine-protein kinase pim-1 (PIM1)
Type:
Protein
Mol. Mass.:
35681.82
Organism:
Homo sapiens (Human)
Description:
P11309
Residue:
313
  
Inhibitor
Name:
BDBM50129863
Synonyms:
CHEMBL3629384
Type:
Small organic molecule
Emp. Form.:
C20H18N2O3
Mol. Mass.:
334.3685
SMILES:
OCCOC1Cn2cc(C=O)c3ccc4c5ccccc5n(C1)c4c23
: