Target
Carbonic anhydrase 1
Ligand
BDBM12414
Substrate
Meas. Tech.
ChEMBL_1524262 (CHEMBL3631738)
Ki
39960±n/a nM
Citation
 Fidan, ISalmas, REArslan, MSentürk, MDurdagi, SEkinci, DSentürk, ECosgun, SSupuran, CT Carbonic anhydrase inhibitors: Design, synthesis, kinetic, docking and molecular dynamics analysis of novel glycine and phenylalanine sulfonamide derivatives. Bioorg Med Chem 23:7353-8 (2015)  
Target
Name:
Carbonic anhydrase 1
Synonyms:
CA-I CAB Carbonate dehydratase I Carbonic anhydrase 1 (CA I) Carbonic anhydrase 1 (Recombinant CA I) Carbonic anhydrase B Carbonic anhydrase I (CA I) Carbonic anhydrase I (CAI) Carbonic anhydrase isoenzyme I (hCA I) | hCA
Type:
Enzyme
Mol. Mass.:
28873.37
Organism:
Homo sapiens (Human)
Description:
P00915
Residue:
261
  
Inhibitor
Name:
BDBM12414
Synonyms:
CHEMBL27601 hCA inhibitor, 6
Type:
Small organic molecule
Emp. Form.:
C6H7NO2S
Mol. Mass.:
157.19
SMILES:
NS(=O)(=O)c1ccccc1
: