Target
Interleukin-1 receptor-associated kinase 4
Ligand
BDBM50130670
Substrate
Meas. Tech.
ChEMBL_1526986 (CHEMBL3637446)
IC50
0.700000±n/a nM
Citation
 Lim, JAltman, MDBaker, JBrubaker, JDChen, HChen, YKleinschek, MALi, CLiu, DMaclean, JKMulrooney, EFPresland, JRakhilina, LSmith, GFYang, R Identification of N-(1H-pyrazol-4-yl)carboxamide inhibitors of interleukin-1 receptor associated kinase 4: Bicyclic core modifications. Bioorg Med Chem Lett 25:5384-8 (2015)  
Target
Name:
Interleukin-1 receptor-associated kinase 4
Synonyms:
IRAK-4 IRAK4_HUMAN Interleukin-1 receptor-associated kinase 4 (IRAK4) | Renal carcinoma antigen NY-REN-64
Type:
Protein
Mol. Mass.:
51519.08
Organism:
Homo sapiens (Human)
Description:
Q9NWZ3
Residue:
460
  
Inhibitor
Name:
BDBM50130670
Synonyms:
CHEMBL3634615
Type:
Small organic molecule
Emp. Form.:
C19H22N8O
Mol. Mass.:
378.431
SMILES:
Cn1cc(NC(=O)c2ccc3ccc(N[C@@H]4CCCC[C@@H]4N)nn23)c(n1)C#N
: