Target
MAP kinase-interacting serine/threonine-protein kinase 2
Ligand
BDBM50130704
Substrate
Meas. Tech.
ChEMBL_1527068 (CHEMBL3637759)
Ki
18±n/a nM
Citation
 Teo, TYang, YYu, MBasnet, SKGillam, THou, JSchmid, RMKumarasiri, MDiab, SAlbrecht, HSykes, MJWang, S An integrated approach for discovery of highly potent and selective Mnk inhibitors: Screening, synthesis and SAR analysis. Eur J Med Chem 103:539-50 (2015)  
Target
Name:
MAP kinase-interacting serine/threonine-protein kinase 2
Synonyms:
GPRK7 MAP kinase-interacting serine/threonine-protein kinase 2 (MKNK2) MAP-kinase interacting kinase 2 (MNK2) MKNK2_HUMAN | MNK2
Type:
Protein
Mol. Mass.:
51870.79
Organism:
Homo sapiens (Human)
Description:
Q9HBH9
Residue:
465
  
Inhibitor
Name:
BDBM50130704
Synonyms:
CHEMBL3632744
Type:
Small organic molecule
Emp. Form.:
C18H19FN4O2S
Mol. Mass.:
374.432
SMILES:
CNC(=O)c1sc2ncnc(Nc3ccc(F)cc3OC(C)C)c2c1C
: