Target
P2Y purinoceptor 1
Ligand
BDBM50366480
Substrate
Meas. Tech.
ChEBML_1526464
EC50
850±n/a nM
Citation
 Azran, SDanino, OFörster, DKenigsberg, SReiser, GDixit, MSingh, VMajor, DTFischer, B Identification of Highly Promising Antioxidants/Neuroprotectants Based on Nucleoside 5'-Phosphorothioate Scaffold. Synthesis, Activity, and Mechanisms of Action. J Med Chem 58:8427-43 (2015)  
Target
Name:
P2Y purinoceptor 1
Synonyms:
ATP receptor P2RY1_HUMAN P2Y1 Purinergic receptor P2Y1
Type:
Enzyme
Mol. Mass.:
42090.25
Organism:
Homo sapiens (Human)
Description:
P47900
Residue:
373
  
Inhibitor
Name:
BDBM50366480
Synonyms:
ADENOSINE TRIPHOSPHATE | ATP
Type:
Small organic molecule
Emp. Form.:
C10H16N5O13P3
Mol. Mass.:
507.181
SMILES:
Nc1ncnc2n(cnc12)[C@@H]1O[C@H](CO[P@](O)(=O)O[P@@](O)(=O)OP(O)(O)=O)[C@@H](O)[C@H]1O
: