Target
P2Y purinoceptor 11
Ligand
BDBM50131059
Substrate
Meas. Tech.
ChEBML_1526465
EC50
8700±n/a nM
Citation
 Azran, SDanino, OFörster, DKenigsberg, SReiser, GDixit, MSingh, VMajor, DTFischer, B Identification of Highly Promising Antioxidants/Neuroprotectants Based on Nucleoside 5'-Phosphorothioate Scaffold. Synthesis, Activity, and Mechanisms of Action. J Med Chem 58:8427-43 (2015)  
Target
Name:
P2Y purinoceptor 11
Synonyms:
P2RY11 P2Y11 Purinergic receptor P2Y11
Type:
PROTEIN
Mol. Mass.:
40366.02
Organism:
Homo sapiens (Human)
Description:
ChEMBL_1362532
Residue:
374
  
Inhibitor
Name:
BDBM50131059
Synonyms:
CHEMBL575257
Type:
Small organic molecule
Emp. Form.:
C10H15N5O9P2S
Mol. Mass.:
443.267
SMILES:
Nc1ncnc2n(cnc12)[C@@H]1O[C@H](COP(S)(=O)OP(O)(O)=O)[C@@H](O)[C@H]1O
: