Target
Kynurenine 3-monooxygenase
Ligand
BDBM50131811
Substrate
Meas. Tech.
ChEMBL_1526206 (CHEMBL3636891)
IC50
>794±n/a nM
Citation
 Abdel-Magid, AF Kynurenine Monooxygenase (KMO) Inhibitors for the Treatment of Acute Pancreatitis and Neurodegenerative Disorders. ACS Med Chem Lett 6:954-5 (2015)  
Target
Name:
Kynurenine 3-monooxygenase
Synonyms:
KMO | KMO_HUMAN
Type:
PROTEIN
Mol. Mass.:
55831.03
Organism:
Homo sapiens (Human)
Description:
ChEMBL_1487479
Residue:
486
  
Inhibitor
Name:
BDBM50131811
Synonyms:
CHEMBL3634601
Type:
Small organic molecule
Emp. Form.:
C15H14ClN3O5
Mol. Mass.:
351.742
SMILES:
Cn1ccnc1COc1cc2oc(=O)n(CCC(O)=O)c2cc1Cl
: