Target
Muscarinic acetylcholine receptor M5
Ligand
BDBM50132341
Substrate
Meas. Tech.
ChEMBL_1527278 (CHEMBL3636157)
Ki
>900±n/a nM
Citation
 Ponnala, SKapadia, NMadapa, SAlberts, ILHarding, WW Synthesis and evaluation of aporphine analogs containing C1 allyl isosteres at the h5-HT(2A) receptor. Bioorg Med Chem Lett 25:5102-6 (2015)  
Target
Name:
Muscarinic acetylcholine receptor M5
Synonyms:
ACM5_HUMAN | CHRM5
Type:
PROTEIN
Mol. Mass.:
60102.35
Organism:
Homo sapiens (Human)
Description:
ChEMBL_1517990
Residue:
532
  
Inhibitor
Name:
BDBM50132341
Synonyms:
CHEMBL3633757
Type:
Small organic molecule
Emp. Form.:
C26H24BrNO4
Mol. Mass.:
494.377
SMILES:
COc1cc2CCN(C)C3Cc4cc5OCOc5cc4-c(c1OCc1ccc(Br)cc1)c23
: