Target
Alpha-2A adrenergic receptor
Ligand
BDBM50132341
Substrate
Meas. Tech.
ChEMBL_1527395 (CHEMBL3636770)
Ki
<300±n/a nM
Citation
 Ponnala, SKapadia, NMadapa, SAlberts, ILHarding, WW Synthesis and evaluation of aporphine analogs containing C1 allyl isosteres at the h5-HT(2A) receptor. Bioorg Med Chem Lett 25:5102-6 (2015)  
Target
Name:
Alpha-2A adrenergic receptor
Synonyms:
ADA2A_HUMAN ADRA2R Adrenergic alpha2A Alpha-2 adrenergic receptor subtype C10 Alpha-2A adrenoreceptor alpha-2A adrenergic receptor [Homo sapiens]
Type:
Enzyme
Mol. Mass.:
48979.91
Organism:
Homo sapiens (Human)
Description:
P08913
Residue:
450
  
Inhibitor
Name:
BDBM50132341
Synonyms:
CHEMBL3633757
Type:
Small organic molecule
Emp. Form.:
C26H24BrNO4
Mol. Mass.:
494.377
SMILES:
COc1cc2CCN(C)C3Cc4cc5OCOc5cc4-c(c1OCc1ccc(Br)cc1)c23
: